BDBM50289736 CHEMBL56349::[4-Benzo[1,3]dioxol-5-yl-1-(2-methoxy-benzyl)-2-oxo-1,2-dihydro-quinolin-3-yl]-acetic acid
SMILES COc1ccccc1Cn1c2ccccc2c(-c2ccc3OCOc3c2)c(CC(O)=O)c1=O
InChI Key InChIKey=AKHRQANJSKGZGG-UHFFFAOYSA-N
Data  2 IC50
  Tab Delimited (TSV)   2D SDfile   Computed 3D by Vconf -m prep SDfile
Find this compound or compounds like it in BindingDB:
Activity Spreadsheet -- Enzyme Inhibition Constant Data from BindingDB
Found 2 hits for monomerid = 50289736
TargetEndothelin receptor type B(Homo sapiens (Human))
TBA
Curated by ChEMBL
LigandPNGBDBM50289736(CHEMBL56349 | [4-Benzo[1,3]dioxol-5-yl-1-(2-methox...)
Affinity DataIC50: >1.00E+4nM. Assay description: Inhibition of [125I]-ET-1 binding to porcine kidney inner medulla membranes
In DepthDetails Article
TargetEndothelin-1 receptor(RAT)
TBA
Curated by ChEMBL
LigandPNGBDBM50289736(CHEMBL56349 | [4-Benzo[1,3]dioxol-5-yl-1-(2-methox...)
Affinity DataIC50: >1.00E+4nM. Assay description: Inhibition of [125I]-ET-1 binding to rat aorta membranes(ETA)
In DepthDetails Article