BDBM50290980 2-[4-Benzo[1,3]dioxol-5-yl-2-(4-methoxy-phenyl)-5-oxo-3-(3,4,5-trimethoxy-benzyl)-2,5-dihydro-furan-2-yloxycarbonylamino]-4-methyl-pentanoic acid ethyl ester::CHEMBL316523
SMILES CCOC(=O)C(CC(C)C)NC(=O)OC1(OC(=O)C(=C1Cc1cc(OC)c(OC)c(OC)c1)c1ccc2OCOc2c1)c1ccc(OC)cc1
InChI Key InChIKey=AGWINCPCXUTIHM-UHFFFAOYSA-N
Data  2 IC50
  Tab Delimited (TSV)   2D SDfile   Computed 3D by Vconf -m prep SDfile
Find this compound or compounds like it in BindingDB:
Activity Spreadsheet -- Enzyme Inhibition Constant Data from BindingDB
Found 2 hits for monomerid = 50290980
TargetEndothelin receptor type B(Homo sapiens (Human))
TBA
Curated by ChEMBL
LigandPNGBDBM50290980(2-[4-Benzo[1,3]dioxol-5-yl-2-(4-methoxy-phenyl)-5-...)
Affinity DataIC50:  2.50E+3nM. Assay description: Binding affinity for human endothelin B receptor expressed in CHO-K1 cells.
In DepthDetails Article
TargetEndothelin-1 receptor(Homo sapiens (Human))
TBA
Curated by ChEMBL
LigandPNGBDBM50290980(2-[4-Benzo[1,3]dioxol-5-yl-2-(4-methoxy-phenyl)-5-...)
Affinity DataIC50:  0.5nM. Assay description: Binding affinity for human Endothelin A receptor expressed in LtK- cells
In DepthDetails Article