BDBM50293026 (Sar)WTLNSAGYLLGPKK(Lys-palmitoyl)K::CHEMBL507353
SMILES CCCCCCCCCCCCCCCC(=O)NCCCC[C@H](NC(=O)[C@H](CCCCN)NC(=O)[C@H](CCCCN)NC(=O)[C@@H]1CCCN1C(=O)CNC(=O)[C@H](CC(C)C)NC(=O)[C@H](CC(C)C)NC(=O)[C@H](Cc1ccc(O)cc1)NC(=O)CNC(=O)[C@H](C)NC(=O)[C@H](CO)NC(=O)[C@H](CC(N)=O)NC(=O)[C@H](CC(C)C)NC(=O)[C@@H](NC(=O)[C@H](Cc1c[nH]c2ccccc12)OC(=O)CNC)[C@@H](C)O)C(=O)N[C@@H](CCCCN)C(N)=O
InChI Key InChIKey=JPTGYQMVTVXYRV-CMDPNKGGSA-N
Data  2 KI
  Tab Delimited (TSV)   2D SDfile   Computed 3D by Vconf -m prep SDfile
Find this compound or compounds like it in BindingDB:
Activity Spreadsheet -- Enzyme Inhibition Constant Data from BindingDB
Found 2 hits for monomerid = 50293026
TargetGalanin receptor type 1(Homo sapiens (Human))
University Of Utah
Curated by ChEMBL
LigandPNGBDBM50293026((Sar)WTLNSAGYLLGPKK(Lys-palmitoyl)K | CHEMBL507353)
Affinity DataKi:  3.5nM. Assay description: Displacement of europium labeled galanin from human recombinant GalR1 receptor by time-resolved fluorescence binding assay
In DepthDetails ArticlePubMed
TargetGalanin receptor type 2(Homo sapiens (Human))
University Of Utah
Curated by ChEMBL
LigandPNGBDBM50293026((Sar)WTLNSAGYLLGPKK(Lys-palmitoyl)K | CHEMBL507353)
Affinity DataKi:  52nM. Assay description: Displacement of europium labeled galanin from human recombinant GalR2 receptor by time-resolved fluorescence binding assay
In DepthDetails ArticlePubMed