BDBM50301815 2,2-dimethyl-5-(5-methyl-1-(pyridin-3-yl)-1H-1,2,3-triazol-4-yl)-2,3-dihydro-1H-inden-1-one::CHEMBL568451
SMILES Cc1c(nnn1-c1cccnc1)-c1ccc2C(=O)C(C)(C)Cc2c1
InChI Key InChIKey=BZIBIEYKXKMKQG-UHFFFAOYSA-N
Data  1 IC50
  Tab Delimited (TSV)   2D SDfile   Computed 3D by Vconf -m prep SDfile
Find this compound or compounds like it in BindingDB:
Activity Spreadsheet -- Enzyme Inhibition Constant Data from BindingDB
Found 1 hit for monomerid = 50301815
TargetMetabotropic glutamate receptor 1(Homo sapiens (Human))
Tsukuba Research Institute
Curated by ChEMBL
LigandPNGBDBM50301815(2,2-dimethyl-5-(5-methyl-1-(pyridin-3-yl)-1H-1,2,3...)
Affinity DataIC50:  11nM. Assay description: Antagonist activity at human mGluR1 receptor expressed in CHO cell membranes assessed as inhibition of L-glutamate-induced calcium mobilization by FL...
In DepthDetails ArticlePubMed