BDBM50306705 ((2R,3S,4R,5R)-5-(5-fluoro-2,4-dioxo-3,4-dihydropyrimidin-1(2H)-yl)-3,4-dihydroxytetrahydrofuran-2-yl)methyl tetrahydrogen triphosphate::CHEMBL1774
SMILES O[C@H]1[C@@H](O)[C@@H](O[C@@H]1COP(O)(=O)OP(O)(=O)OP(O)(O)=O)n1cc(F)c(=O)[nH]c1=O
InChI Key InChIKey=AREUQFTVCMGENT-UAKXSSHOSA-N
Data  2 EC50
  Tab Delimited (TSV)   2D SDfile   Computed 3D by Vconf -m prep SDfile
Find this compound or compounds like it in BindingDB:
Activity Spreadsheet -- Enzyme Inhibition Constant Data from BindingDB
Found 2 hits for monomerid = 50306705
TargetP2Y purinoceptor 4(Homo sapiens (Human))
Bar-Ilan University
Curated by ChEMBL
LigandPNGBDBM50306705(((2R,3S,4R,5R)-5-(5-fluoro-2,4-dioxo-3,4-dihydropy...)
Affinity DataEC50:  600nM. Assay description: Agonist activity at human P2Y4 receptor expressed in human 1321N1 cells assessed as concentration required to 50% maximal response of compound 3 at 1...
In DepthDetails ArticlePubMed
TargetP2Y purinoceptor 2(Homo sapiens (Human))
Bar-Ilan University
Curated by ChEMBL
LigandPNGBDBM50306705(((2R,3S,4R,5R)-5-(5-fluoro-2,4-dioxo-3,4-dihydropy...)
Affinity DataEC50:  6.00E+3nM. Assay description: Agonist activity at human P2Y2 receptor expressed in human 1321N1 cells assessed as calcium elevation by fura2/AM assay
In DepthDetails ArticlePubMed