BDBM50307487 2-(6-Bromopyridin-2-yloxy)-N,N-dimethylethan-amine::CHEMBL597356
SMILES CN(C)CCOc1cccc(Br)n1
InChI Key InChIKey=GBZVFQICYGHZFW-UHFFFAOYSA-N
Data  2 KI
  Tab Delimited (TSV)   2D SDfile   Computed 3D by Vconf -m prep SDfile
Find this compound or compounds like it in BindingDB:
Activity Spreadsheet -- Enzyme Inhibition Constant Data from BindingDB
Found 2 hits for monomerid = 50307487
Target5-hydroxytryptamine receptor 1A(Rattus norvegicus (rat))
Universit£
Curated by ChEMBL
LigandPNGBDBM50307487(2-(6-Bromopyridin-2-yloxy)-N,N-dimethylethan-amine...)
Affinity DataKi:  902nM. Assay description: Displacement of [3H]8-OH-DPAT from 5HT1A receptor in rat hippocampus
In DepthDetails ArticlePubMed
Target5-hydroxytryptamine receptor 7(Homo sapiens (Human))
Universit£
Curated by ChEMBL
LigandPNGBDBM50307487(2-(6-Bromopyridin-2-yloxy)-N,N-dimethylethan-amine...)
Affinity DataKi:  2.24E+3nM. Assay description: Displacement of [3H]5CT from human cloned 5HT7B receptor expressed in HEK293 cells
In DepthDetails ArticlePubMed