BDBM50311341 CHEMBL1079007::N1-(benzo[d]thiazol-2-yl)-N4-(3-ethoxy-4-methoxyphenyl)cyclohexane-1,4-diamine
SMILES CCOc1cc(NC2CCC(CC2)Nc2nc3ccccc3s2)ccc1OC
InChI Key InChIKey=AETYXCWWYJOPNZ-UHFFFAOYSA-N
Data  4 KI
  Tab Delimited (TSV)   2D SDfile   Computed 3D by Vconf -m prep SDfile
Find this compound or compounds like it in BindingDB:
Activity Spreadsheet -- Enzyme Inhibition Constant Data from BindingDB
Found 4 hits for monomerid = 50311341
TargetSomatostatin receptor type 5(Homo sapiens (Human))
F. Hoffmann-La Roche
Curated by ChEMBL
LigandPNGBDBM50311341(CHEMBL1079007 | N1-(benzo[d]thiazol-2-yl)-N4-(3-et...)
Affinity DataKi: >1.00E+3nM. Assay description: Displacement of SST14 from human recombinant SST5 receptor expressed in CHO cells by radioligand binding assay
In DepthDetails ArticlePubMed
TargetSomatostatin receptor type 2(Homo sapiens (Human))
F. Hoffmann-La Roche
Curated by ChEMBL
LigandPNGBDBM50311341(CHEMBL1079007 | N1-(benzo[d]thiazol-2-yl)-N4-(3-et...)
Affinity DataKi: >1.00E+4nM. Assay description: Displacement of SST14 from human recombinant SST2 receptor
In DepthDetails ArticlePubMed
TargetSomatostatin receptor type 3(Homo sapiens (Human))
F. Hoffmann-La Roche
Curated by ChEMBL
LigandPNGBDBM50311341(CHEMBL1079007 | N1-(benzo[d]thiazol-2-yl)-N4-(3-et...)
Affinity DataKi: >1.00E+4nM. Assay description: Displacement of SST14 from human recombinant SST3 receptor
In DepthDetails ArticlePubMed
TargetSomatostatin receptor type 4(Homo sapiens (Human))
F. Hoffmann-La Roche
Curated by ChEMBL
LigandPNGBDBM50311341(CHEMBL1079007 | N1-(benzo[d]thiazol-2-yl)-N4-(3-et...)
Affinity DataKi: >1.00E+4nM. Assay description: Displacement of SST14 from human recombinant SST4 receptor
In DepthDetails ArticlePubMed