BDBM50313146 6-chloro-3-(3-fluorophenylsulfonyl)-1-(pyrrolidin-3-yl)-1H-indole::CHEMBL1080694
SMILES Fc1cccc(c1)S(=O)(=O)c1cn(C2CCNC2)c2cc(Cl)ccc12
InChI Key InChIKey=AFTKXLGGILZMHW-UHFFFAOYSA-N
Data  1 KI
  Tab Delimited (TSV)   2D SDfile   Computed 3D by Vconf -m prep SDfile
Find this compound or compounds like it in BindingDB:
Activity Spreadsheet -- Enzyme Inhibition Constant Data from BindingDB
Found 1 hit for monomerid = 50313146
Target5-hydroxytryptamine receptor 6(Homo sapiens (Human))
Wyeth Pharmaceuticals
Curated by ChEMBL
LigandPNGBDBM50313146(6-chloro-3-(3-fluorophenylsulfonyl)-1-(pyrrolidin-...)
Affinity DataKi:  72nM. Assay description: Displacement of [3H]LSD from human 5-HT6 receptor expressed in human HeLa cells after 2 hrs
In DepthDetails ArticlePubMed