BDBM50314724 1-(thiazol-2-yl)ethanone O-4-methoxybenzoyl oxime::CHEMBL1092114
SMILES COc1ccc(cc1)C(=O)O\N=C(/C)c1nccs1
InChI Key InChIKey=LZDAJNLKAUTBLD-OQLLNIDSSA-N
Data  1 IC50
  Tab Delimited (TSV)   2D SDfile   Computed 3D by Vconf -m prep SDfile
Find this compound or compounds like it in BindingDB:
Activity Spreadsheet -- Enzyme Inhibition Constant Data from BindingDB
Found 1 hit for monomerid = 50314724
TargetSerine hydrolase RBBP9(Homo sapiens (Human))
The Scripps Research Institute
Curated by ChEMBL
LigandPNGBDBM50314724(1-(thiazol-2-yl)ethanone O-4-methoxybenzoyl oxime ...)
Affinity DataIC50:  9.20E+3nM. Assay description: Displacement of fluorophosphate-rhodamine from RBBP9 transfected in human HEK293T cells proteomes after 30 mins by SDS-PAGE gel fluorescence assay
In DepthDetails ArticlePubMed