BDBM50314804 (R)-3-amino-3-carboxypropyl-2'-carboxyethyl phosphinic acid::CHEMBL1089514
SMILES N[C@H](CCP(O)(=O)CCC(O)=O)C(O)=O
InChI Key InChIKey=CIOKCIBFBZYLCA-RXMQYKEDSA-N
Data  3 EC50
  Tab Delimited (TSV)   2D SDfile   Computed 3D by Vconf -m prep SDfile
Find this compound or compounds like it in BindingDB:
Activity Spreadsheet -- Enzyme Inhibition Constant Data from BindingDB
Found 3 hits for monomerid = 50314804
TargetMetabotropic glutamate receptor 8(Rattus norvegicus (Rat))
Universite Paris Descartes
Curated by ChEMBL
LigandPNGBDBM50314804((R)-3-amino-3-carboxypropyl-2'-carboxyethyl phosph...)
Affinity DataEC50:  5.80E+4nM. Assay description: Agonist activity at rat mGlu8 receptor expressed in HEK293 cells co-transfected with G-protein alpha and EAAC1 assessed as increase in intracellular ...
In DepthDetails ArticlePubMed
TargetMetabotropic glutamate receptor 6(Rattus norvegicus (Rat))
Universite Paris Descartes
Curated by ChEMBL
LigandPNGBDBM50314804((R)-3-amino-3-carboxypropyl-2'-carboxyethyl phosph...)
Affinity DataEC50:  9.90E+4nM. Assay description: Agonist activity at rat mGlu6 receptor expressed in HEK293 cells co-transfected with G-protein alpha and EAAC1 assessed as increase in intracellular ...
In DepthDetails ArticlePubMed
TargetMetabotropic glutamate receptor 4(Rattus norvegicus (Rat))
Universite Paris Descartes
Curated by ChEMBL
LigandPNGBDBM50314804((R)-3-amino-3-carboxypropyl-2'-carboxyethyl phosph...)
Affinity DataEC50:  1.70E+4nM. Assay description: Agonist activity at rat mGlu4 receptor expressed in HEK293 cells co-transfected with G-protein alpha and EAAC1 assessed as increase in intracellular ...
In DepthDetails ArticlePubMed