BDBM50319129 CHEMBL1084020::CHEMBL1204010::N4-Methoxycytidine 5'-Diphosphate triethylammonium Salt
SMILES CONc1ccn([C@@H]2O[C@H](COP(O)(=O)OP(O)(O)=O)[C@@H](O)[C@H]2O)c(=O)n1
InChI Key InChIKey=GSCCOZXWAPBMKO-ZOQUXTDFSA-N
Data  6 EC50
  Tab Delimited (TSV)   2D SDfile   Computed 3D by Vconf -m prep SDfile
Find this compound or compounds like it in BindingDB:
Activity Spreadsheet -- Enzyme Inhibition Constant Data from BindingDB
Found 6 hits for monomerid = 50319129
TargetP2Y purinoceptor 2(Homo sapiens (Human))
National Institute Of Diabetes And Digestive And Kidney Diseases
Curated by ChEMBL
LigandPNGBDBM50319129(CHEMBL1084020 | CHEMBL1204010 | N4-Methoxycytidine...)
Affinity DataEC50:  3.60E+3nM. Assay description: Agonist activity at human recombinant P2Y2 receptor expressed in human 1321N1 cells assessed as [3H]inositol phosphate production by scintillation pr...
In DepthDetails ArticlePubMed
TargetP2Y purinoceptor 4(Homo sapiens (Human))
National Institute Of Diabetes And Digestive And Kidney Diseases
Curated by ChEMBL
LigandPNGBDBM50319129(CHEMBL1084020 | CHEMBL1204010 | N4-Methoxycytidine...)
Affinity DataEC50:  6.45E+3nM. Assay description: Agonist activity at human recombinant P2Y4 receptor expressed in human 1321N1 cells assessed as [3H]inositol phosphate production by scintillation pr...
In DepthDetails ArticlePubMed
TargetP2Y purinoceptor 14(Homo sapiens (Human))
National Institute Of Diabetes And Digestive And Kidney Diseases
Curated by ChEMBL
LigandPNGBDBM50319129(CHEMBL1084020 | CHEMBL1204010 | N4-Methoxycytidine...)
Affinity DataEC50:  3.32E+3nM. Assay description: Agonist activity at human P2Y14 receptor expressed in HEK293 cells coexpressing phospholipase C-activating Gi protein cells assessed as inhibition of...
In DepthDetails ArticlePubMed
TargetP2Y purinoceptor 14(Homo sapiens (Human))
National Institute Of Diabetes And Digestive And Kidney Diseases
Curated by ChEMBL
LigandPNGBDBM50319129(CHEMBL1084020 | CHEMBL1204010 | N4-Methoxycytidine...)
Affinity DataEC50:  3.32E+3nM. Assay description: Agonist activity at human recombinant P2Y14 receptor expressed in HEK293 cells assessed as [3H]inositol phosphate production by scintillation proximi...
In DepthDetails ArticlePubMed
TargetP2Y purinoceptor 6(Homo sapiens (Human))
National Institute Of Diabetes And Digestive And Kidney Diseases
Curated by ChEMBL
LigandPNGBDBM50319129(CHEMBL1084020 | CHEMBL1204010 | N4-Methoxycytidine...)
Affinity DataEC50:  70nM. Assay description: Agonist activity at human P2Y6 receptor expressed in human 1321N1 cells coexpressing phospholipase C-activating Gq protein assessed as [3H]inositol p...
In DepthDetails ArticlePubMed
TargetP2Y purinoceptor 6(Homo sapiens (Human))
National Institute Of Diabetes And Digestive And Kidney Diseases
Curated by ChEMBL
LigandPNGBDBM50319129(CHEMBL1084020 | CHEMBL1204010 | N4-Methoxycytidine...)
Affinity DataEC50:  3.60E+3nM. Assay description: Agonist activity at human recombinant P2Y6 receptor expressed in human 1321N1 cells assessed as [3H]inositol phosphate production by scintillation pr...
In DepthDetails ArticlePubMed