BDBM50320824 CHEMBL1163739::N-{4-[3-(b-Alanylamino)phenyl]-3-cyano-6-(2-hydroxyphenyl)-5-methylpyridin-2-yl}furan-2-carboxamide
SMILES Cc1c(nc(NC(=O)c2ccco2)c(C#N)c1-c1cccc(NC(=O)CCN)c1)-c1ccccc1O
InChI Key InChIKey=GIEQJUHXNONDDG-UHFFFAOYSA-N
Data  1 IC50
  Tab Delimited (TSV)   2D SDfile   Computed 3D by Vconf -m prep SDfile
Find this compound or compounds like it in BindingDB:
Activity Spreadsheet -- Enzyme Inhibition Constant Data from BindingDB
Found 1 hit for monomerid = 50320824
TargetKiSS-1 receptor(Homo sapiens (Human))
Takeda Pharmaceutical
Curated by ChEMBL
LigandPNGBDBM50320824(CHEMBL1163739 | N-{4-[3-(b-Alanylamino)phenyl]-3-c...)
Affinity DataIC50:  1.20E+3nM. Assay description: Displacement of [125I]metastin(40-54) from human GPR54 receptor expressed in CHO cells after 60 mins by scintillation counting
In DepthDetails ArticlePubMed