BDBM50322004 5-(2-Bromophenyl)-3-(3,4-dimethylphenyl)-4,5-dihydro-1H-pyrazole-1-carbothioamide::CHEMBL1173688
SMILES Cc1ccc(cc1C)C1=NN(C(C1)c1ccccc1Br)C(N)=S
InChI Key InChIKey=VGQBMUAWNKHSJS-UHFFFAOYSA-N
Data  1 IC50
  Tab Delimited (TSV)   2D SDfile   Computed 3D by Vconf -m prep SDfile
Find this compound or compounds like it in BindingDB:
Activity Spreadsheet -- Enzyme Inhibition Constant Data from BindingDB
Found 1 hit for monomerid = 50322004
TargetEpidermal growth factor receptor(Homo sapiens (Human))
Nanjing University
Curated by ChEMBL
LigandPNGBDBM50322004(5-(2-Bromophenyl)-3-(3,4-dimethylphenyl)-4,5-dihyd...)
Affinity DataIC50:  4.21E+3nM. Assay description: Inhibition of histidine-tagged recombinant EGFR autophosphorylation expressed in Sf9 cells by solid-phase ELISA
In DepthDetails ArticlePubMed