BDBM50322173 CHEMBL1173061::N-(1-phenylpropan-2-yl)-3-(phenylsulfonyl)thieno[2,3-e][1,2,3]triazolo[1,5-a]pyrimidin-5-amine
SMILES CC(Cc1ccccc1)Nc1nc2c(nnn2c2ccsc12)S(=O)(=O)c1ccccc1
InChI Key InChIKey=AEIPBBCXMJIOKZ-UHFFFAOYSA-N
Data  1 IC50
  Tab Delimited (TSV)   2D SDfile   Computed 3D by Vconf -m prep SDfile
Find this compound or compounds like it in BindingDB:
Activity Spreadsheet -- Enzyme Inhibition Constant Data from BindingDB
Found 1 hit for monomerid = 50322173
Target5-hydroxytryptamine receptor 6(Homo sapiens (Human))
Chemical Diversity Research Institute
Curated by ChEMBL
LigandPNGBDBM50322173(CHEMBL1173061 | N-(1-phenylpropan-2-yl)-3-(phenyls...)
Affinity DataIC50:  1.08E+3nM. Assay description: Antagonist activity at human recombinant 5HT6 receptor expressed in HEK293 cells assessed as inhibition of serotonin-induced cAMP production
In DepthDetails ArticlePubMed