BDBM50322447 CHEMBL1171995::rac-1-(4-{4-[5-Methanesulfonyl-2-(2,2,2-trifluoro-1-methyl-ethoxy)-benzoyl]-piperazin-1-yl}-phenyl)ethanone
SMILES CC(Oc1ccc(cc1C(=O)N1CCN(CC1)c1ccc(cc1)C(C)=O)S(C)(=O)=O)C(F)(F)F
InChI Key InChIKey=AUOFMPDTQJOGSS-UHFFFAOYSA-N
Data  2 EC50
  Tab Delimited (TSV)   2D SDfile   Computed 3D by Vconf -m prep SDfile
Find this compound or compounds like it in BindingDB:
Activity Spreadsheet -- Enzyme Inhibition Constant Data from BindingDB
Found 2 hits for monomerid = 50322447
TargetSodium- and chloride-dependent glycine transporter 1(Homo sapiens (Human))
F. Hoffmann-La Roche
Curated by ChEMBL
LigandPNGBDBM50322447(CHEMBL1171995 | rac-1-(4-{4-[5-Methanesulfonyl-2-(...)
Affinity DataEC50:  91nM. Assay description: Inhibition of human GlyT1b expressed in CHO cells assessed as inhibition of [3H]glycine uptake by liquid scintillation counting
In DepthDetails ArticlePubMed
TargetSodium- and chloride-dependent glycine transporter 2(Homo sapiens (Human))
F. Hoffmann-La Roche
Curated by ChEMBL
LigandPNGBDBM50322447(CHEMBL1171995 | rac-1-(4-{4-[5-Methanesulfonyl-2-(...)
Affinity DataEC50: >3.00E+4nM. Assay description: Inhibition of human GlyT2 expressed in CHO cells assessed as inhibition of [3H]glycine uptake by liquid scintillation counting
In DepthDetails ArticlePubMed