BDBM50322668 2'-(9H-fluoren-3-ylcarbamoyl)biphenyl-2-carboxylic acid::CHEMBL1173451
SMILES OC(=O)c1ccccc1-c1ccccc1C(=O)Nc1ccc2Cc3ccccc3-c2c1
InChI Key InChIKey=LNIBWMGLLPEMHJ-UHFFFAOYSA-N
Data  2 IC50
  Tab Delimited (TSV)   2D SDfile   Computed 3D by Vconf -m prep SDfile
Find this compound or compounds like it in BindingDB:
Activity Spreadsheet -- Enzyme Inhibition Constant Data from BindingDB
Found 2 hits for monomerid = 50322668
TargetPeroxisome proliferator-activated receptor gamma(Homo sapiens (Human))
University Of Nebraska Medical Center
Curated by ChEMBL
LigandPNGBDBM50322668(2'-(9H-fluoren-3-ylcarbamoyl)biphenyl-2-carboxylic...)
Affinity DataIC50:  3.50E+3nM. Assay description: Antagonist activity at PPARgamma (unknown origin) expressed in human LNCaP cells assessed as suppression of pioglitazone-induced PPAR response elemen...
In DepthDetails ArticlePubMed
TargetUDP-glucose 4-epimerase(Trypanosoma brucei)
University Of California San Diego
Curated by ChEMBL
LigandPNGBDBM50322668(2'-(9H-fluoren-3-ylcarbamoyl)biphenyl-2-carboxylic...)
Affinity DataIC50:  4.20E+3nM. Assay description: Inhibition of hexahistidine-tagged Trypanosoma brucei UDP-galactose-4'epimerase expressed in Escherichia coli
In DepthDetails ArticlePubMed