BDBM50323892 6-bromo-4-oxo-3-(quinolin-2-ylmethoxy)-2-(3-(quinolin-2-ylmethoxy)phenyl)-4H-chromene-8-carboxylic acid::CHEMBL1213921
SMILES OC(=O)c1cc(Br)cc2c1oc(-c1cccc(OCc3ccc4ccccc4n3)c1)c(OCc1ccc3ccccc3n1)c2=O
InChI Key InChIKey=AJCUVQGKLQCMGU-UHFFFAOYSA-N
Data  1 IC50
  Tab Delimited (TSV)   2D SDfile   Computed 3D by Vconf -m prep SDfile
Find this compound or compounds like it in BindingDB:
Activity Spreadsheet -- Enzyme Inhibition Constant Data from BindingDB
Found 1 hit for monomerid = 50323892
TargetCysteinyl leukotriene receptor 1(Homo sapiens (Human))
Zhejiang University
Curated by ChEMBL
LigandPNGBDBM50323892(6-bromo-4-oxo-3-(quinolin-2-ylmethoxy)-2-(3-(quino...)
Affinity DataIC50:  63nM. Assay description: Antagonist activity at CysLT1 receptor in human dU937 cells assessed as inhibition of LTD4-induced increase of calcium level treated 30 mins before L...
In DepthDetails ArticlePubMed