BDBM50323901 CHEMBL1213846::E-2-(2-(3-(4-(4-(4-Chlorophenoxy)butoxy)phenyl)acryloyl)phenoxy)acetic acid
SMILES OC(=O)COc1ccccc1C(=O)\C=C\c1ccc(OCCCCOc2ccc(Cl)cc2)cc1
InChI Key InChIKey=SFEWGPHCEYARMN-CXUHLZMHSA-N
Data  1 EC50
  Tab Delimited (TSV)   2D SDfile   Computed 3D by Vconf -m prep SDfile
Find this compound or compounds like it in BindingDB:
Activity Spreadsheet -- Enzyme Inhibition Constant Data from BindingDB
Found 1 hit for monomerid = 50323901
TargetCysteinyl leukotriene receptor 1(Homo sapiens (Human))
Zhejiang University
Curated by ChEMBL
LigandPNGBDBM50323901(CHEMBL1213846 | E-2-(2-(3-(4-(4-(4-Chlorophenoxy)b...)
Affinity DataEC50:  1.40E+3nM. Assay description: Antagonist activity at CysLT1 receptor in human dU937 cells assessed as inhibition of LTD4-induced increase of calcium level treated 30 mins before L...
In DepthDetails ArticlePubMed