BDBM50324540 CHEMBL1215661::Pruvanserin
SMILES Fc1ccc(CCN2CCN(CC2)C(=O)c2cccc3c(c[nH]c23)C#N)cc1
InChI Key InChIKey=AQRLDDAFYYAIJP-UHFFFAOYSA-N
Data  2 KI
  Tab Delimited (TSV)   2D SDfile   Computed 3D by Vconf -m prep SDfile
Find this compound or compounds like it in BindingDB:
Activity Spreadsheet -- Enzyme Inhibition Constant Data from BindingDB
Found 2 hits for monomerid = 50324540
Target5-hydroxytryptamine receptor 2A(Homo sapiens (Human))
Arena Pharmaceuticals
Curated by ChEMBL
LigandPNGBDBM50324540(CHEMBL1215661 | Pruvanserin)
Affinity DataKi:  0.480nM. Assay description: Displacement of [125I]DOI from human recombinant 5HT2A receptor expressed in HEK293 cells after 1 hr by scintillation counting
In DepthDetails ArticlePubMed
Target5-hydroxytryptamine receptor 2C(Homo sapiens (Human))
Arena Pharmaceuticals
Curated by ChEMBL
LigandPNGBDBM50324540(CHEMBL1215661 | Pruvanserin)
Affinity DataKi:  645nM. Assay description: Displacement of [125I]DOI from human recombinant 5HT2C receptor expressed in HEK293 cells after 1 hr by scintillation counting
In DepthDetails ArticlePubMed