BDBM50328456 CHEMBL1258383::N-[4-[4-(2,5-Dimethylphenyl)piperazin-1-yl]butyl]benzo[b]thiophenyl-2-carboxamide
SMILES Cc1ccc(C)c(c1)N1CCN(CCCCNC(=O)c2cc3ccccc3s2)CC1
InChI Key InChIKey=CEGIBPCCIZOPHK-UHFFFAOYSA-N
Data  5 KI
  Tab Delimited (TSV)   2D SDfile   Computed 3D by Vconf -m prep SDfile
Find this compound or compounds like it in BindingDB:
Activity Spreadsheet -- Enzyme Inhibition Constant Data from BindingDB
Found 5 hits for monomerid = 50328456
TargetD(3) dopamine receptor(Homo sapiens (Human))
Friedrich-Alexander University
Curated by ChEMBL
LigandPNGBDBM50328456(CHEMBL1258383 | N-[4-[4-(2,5-Dimethylphenyl)pipera...)
Affinity DataKi:  2.5nM. Assay description: Displacement of [3H]Spiperone from human dopamine D3 receptor expressed in CHO cells
In DepthDetails ArticlePubMed
TargetD(2) dopamine receptor(Homo sapiens (Human))
Friedrich-Alexander University
Curated by ChEMBL
LigandPNGBDBM50328456(CHEMBL1258383 | N-[4-[4-(2,5-Dimethylphenyl)pipera...)
Affinity DataKi:  65nM. Assay description: Displacement of [3H]Spiperone from human dopamine D2 short receptor expressed in CHO cells
In DepthDetails ArticlePubMed
TargetD(2) dopamine receptor(Homo sapiens (Human))
Friedrich-Alexander University
Curated by ChEMBL
LigandPNGBDBM50328456(CHEMBL1258383 | N-[4-[4-(2,5-Dimethylphenyl)pipera...)
Affinity DataKi:  84nM. Assay description: Displacement of [3H]Spiperone from human dopamine D2 long receptor expressed in CHO cells
In DepthDetails ArticlePubMed
Target5-hydroxytryptamine receptor 2A(PIG)
Friedrich-Alexander University
Curated by ChEMBL
LigandPNGBDBM50328456(CHEMBL1258383 | N-[4-[4-(2,5-Dimethylphenyl)pipera...)
Affinity DataKi:  1.50E+3nM. Assay description: Displacement of [3H]Ketanserin from 5-HT2 receptor in pig cortex membranes
In DepthDetails ArticlePubMed
TargetD(1A) dopamine receptor(Sus scrofa)
Friedrich-Alexander University
Curated by ChEMBL
LigandPNGBDBM50328456(CHEMBL1258383 | N-[4-[4-(2,5-Dimethylphenyl)pipera...)
Affinity DataKi:  2.40E+3nM. Assay description: Displacement of [3H]SCH23390 from dopamine D1 receptor in pig striatal membranes
In DepthDetails ArticlePubMed