BDBM50329488 5-Isoxazoyl-Cha-Ile-(3-[aminomethyl]phenyl)-(4-[aminomethyl]-piperidin-1-yl)methanone::CHEMBL1269133
SMILES CC[C@H](C)[C@H](NC(=O)[C@H](CC1CCCCC1)NC(=O)c1ccno1)C(=O)NCc1cccc(c1)C(=O)N1CCC(CN)CC1
InChI Key InChIKey=HXLQLJFWNKMGET-NVLPUFGLSA-N
Data  3 EC50
  Tab Delimited (TSV)   2D SDfile   Computed 3D by Vconf -m prep SDfile
Find this compound or compounds like it in BindingDB:
Activity Spreadsheet -- Enzyme Inhibition Constant Data from BindingDB
Found 3 hits for monomerid = 50329488
TargetProteinase-activated receptor 2(Homo sapiens (Human))
The University Of Queensland
Curated by ChEMBL
LigandPNGBDBM50329488(5-Isoxazoyl-Cha-Ile-(3-[aminomethyl]phenyl)-(4-[am...)
Affinity DataEC50:  251nM. Assay description: Agonist activity at PAR2 receptor in human HT-29 cells assessed as induction of intracellular calcium release
In DepthDetails ArticlePubMed
TargetProteinase-activated receptor 2(Homo sapiens (Human))
The University Of Queensland
Curated by ChEMBL
LigandPNGBDBM50329488(5-Isoxazoyl-Cha-Ile-(3-[aminomethyl]phenyl)-(4-[am...)
Affinity DataEC50:  200nM. Assay description: Agonist activity at human PAR2 expressed in CHO cells assessed as induction of intracellular calcium release measured for 300 secs by Fluo-3 AM dye-b...
In DepthDetails ArticlePubMed
TargetProteinase-activated receptor 2(Homo sapiens (Human))
The University Of Queensland
Curated by ChEMBL
LigandPNGBDBM50329488(5-Isoxazoyl-Cha-Ile-(3-[aminomethyl]phenyl)-(4-[am...)
Affinity DataEC50:  200nM. Assay description: Agonist activity at human PAR2 expressed in CHO cells assessed as induction of intracellular calcium release measured for 300 secs by Fluo-3 AM dye-b...
In DepthDetails ArticlePubMed