BDBM50331210 1-(5-methyl-2,3,4,5-tetrahydro-1H-pyrido[4,3-b]indol-7-yl)-4-(4-(trifluoromethyl)benzyloxy)pyridin-2(1H)-one::CHEMBL1290382
SMILES Cn1c2CCNCc2c2ccc(cc12)-n1ccc(OCc2ccc(cc2)C(F)(F)F)cc1=O
InChI Key InChIKey=AGSHQCQUIRKCKR-UHFFFAOYSA-N
Data  1 KI
  Tab Delimited (TSV)   2D SDfile   Computed 3D by Vconf -m prep SDfile
Find this compound or compounds like it in BindingDB:
Activity Spreadsheet -- Enzyme Inhibition Constant Data from BindingDB
Found 1 hit for monomerid = 50331210
TargetMelanin-concentrating hormone receptor 1(Homo sapiens (Human))
Amri
Curated by ChEMBL
LigandPNGBDBM50331210(1-(5-methyl-2,3,4,5-tetrahydro-1H-pyrido[4,3-b]ind...)
Affinity DataKi:  6.70nM. Assay description: Displacement of [3H]4-(benzyloxy)-1-(1-(2-(pyrrolidin-1-yl)ethyl)-1H-indazol-5-yl)pyridin-2(1H)-one from MCH-1 receptor expressed in CHO-K1 cells
In DepthDetails ArticlePubMed