BDBM50333546 6-methoxy-7-(4-methylpiperazin-1-yl)-1-(naphthalen-2-ylsulfonyl)-2,3-dihydroquinolin-4(1H)-one::CHEMBL1642121
SMILES COc1cc2C(=O)CCN(c2cc1N1CCN(C)CC1)S(=O)(=O)c1ccc2ccccc2c1
InChI Key InChIKey=AMYPFPOCEWHTIS-UHFFFAOYSA-N
Data  1 IC50
  Tab Delimited (TSV)   2D SDfile   Computed 3D by Vconf -m prep SDfile
Find this compound or compounds like it in BindingDB:
Activity Spreadsheet -- Enzyme Inhibition Constant Data from BindingDB
Found 1 hit for monomerid = 50333546
Target5-hydroxytryptamine receptor 6(Homo sapiens (Human))
Korea Research Institute Of Chemical Technology
Curated by ChEMBL
LigandPNGBDBM50333546(6-methoxy-7-(4-methylpiperazin-1-yl)-1-(naphthalen...)
Affinity DataIC50:  165nM. Assay description: Displacement of [3H]LSD from human 5HT6 receptor expressed in HEK293 cells
In DepthDetails ArticlePubMed