BDBM50339235 (1S,2R)-N-((S)-1-((2S,3S)-1-amino-1-oxo-3-phenylbutan-2-ylamino)-3-(1H-indol-3-yl)-1-oxopropan-2-yl)-2-((S)-2-amino-3-(4-hydroxyphenyl)propanamido)cyclohexanecarboxamide::CHEMBL1689539
SMILES C[C@H]([C@H](NC(=O)[C@H](Cc1c[nH]c2ccccc12)NC(=O)[C@H]1CCCC[C@H]1NC(=O)[C@@H](N)Cc1ccc(O)cc1)C(N)=O)c1ccccc1
InChI Key InChIKey=BHRXNCNPQWWEGY-ZNUKHNLPSA-N
Data  2 KI  1 EC50
  Tab Delimited (TSV)   2D SDfile   Computed 3D by Vconf -m prep SDfile
Find this compound or compounds like it in BindingDB:
Activity Spreadsheet -- Enzyme Inhibition Constant Data from BindingDB
Found 3 hits for monomerid = 50339235
TargetMu-type opioid receptor(Rattus norvegicus (rat))
Hungarian Academy Of Sciences
Curated by ChEMBL
LigandPNGBDBM50339235((1S,2R)-N-((S)-1-((2S,3S)-1-amino-1-oxo-3-phenylbu...)
Affinity DataKi:  4.20nM. Assay description: Displacement of [3H]DAMGO from mu opioid receptor in rat brain membrane homogenate by liquid scintillation counting
In DepthDetails ArticlePubMed
TargetDelta-type opioid receptor(Rattus norvegicus (rat))
Hungarian Academy Of Sciences
Curated by ChEMBL
LigandPNGBDBM50339235((1S,2R)-N-((S)-1-((2S,3S)-1-amino-1-oxo-3-phenylbu...)
Affinity DataKi:  1.44E+3nM. Assay description: Displacement of [3H][Ile5,6]deltorphin2 from delta opioid receptor in rat brain membrane homogenate by liquid scintillation counting
In DepthDetails ArticlePubMed
TargetMu-type opioid receptor(Rattus norvegicus (rat))
Hungarian Academy Of Sciences
Curated by ChEMBL
LigandPNGBDBM50339235((1S,2R)-N-((S)-1-((2S,3S)-1-amino-1-oxo-3-phenylbu...)
Affinity DataEC50:  264nM. Assay description: Agonist activity at mu opioid receptor in rat brain membrane by [35S]GTPgammaS binding assay
In DepthDetails ArticlePubMed