BDBM50341715 3-Amino-6-bromo-N-phenylpyrazine-2-carboxamide::CHEMBL1766761
SMILES Nc1ncc(Br)nc1C(=O)Nc1ccccc1
InChI Key InChIKey=UJCAMIUFQVHBFP-UHFFFAOYSA-N
Data  3 IC50
  Tab Delimited (TSV)   2D SDfile   Computed 3D by Vconf -m prep SDfile
Find this compound or compounds like it in BindingDB:
Activity Spreadsheet -- Enzyme Inhibition Constant Data from BindingDB
Found 3 hits for monomerid = 50341715
TargetDNA-dependent protein kinase catalytic subunit(Homo sapiens (Human))
Vertex Pharmaceuticals
Curated by ChEMBL
LigandPNGBDBM50341715(3-Amino-6-bromo-N-phenylpyrazine-2-carboxamide | C...)
Affinity DataIC50: >8.00E+3nM. Assay description: Inhibition of DNAPK after 2 hrs by radiometric phosphate incorporation assay
In DepthDetails ArticlePubMed
TargetSerine-protein kinase ATM(Homo sapiens (Human))
Vertex Pharmaceuticals
Curated by ChEMBL
LigandPNGBDBM50341715(3-Amino-6-bromo-N-phenylpyrazine-2-carboxamide | C...)
Affinity DataIC50: >8.00E+3nM. Assay description: Inhibition of full length recombinant ATM after 24 hrs by radiometric phosphate incorporation assay
In DepthDetails ArticlePubMed
TargetSerine/threonine-protein kinase ATR(Homo sapiens (Human))
Vertex Pharmaceuticals
Curated by ChEMBL
LigandPNGBDBM50341715(3-Amino-6-bromo-N-phenylpyrazine-2-carboxamide | C...)
Affinity DataIC50:  5.20E+3nM. Assay description: Inhibition of full length recombinant ATR after 24 hrs by radiometric phosphate incorporation assay
In DepthDetails ArticlePubMed