BDBM50342725 CHEMBL1771263::N1-(3-(2,6-dichloro-4-methoxyphenyl)-2,5-dimethylpyrazolo[1,5-a]pyrimidin-7-yl)-2-methyl-N2-(tetrahydro-2H-pyran-4-yl)propane-1,2-diamine
SMILES COc1cc(Cl)c(-c2c(C)nn3c(NCC(C)(C)NC4CCOCC4)cc(C)nc23)c(Cl)c1
InChI Key InChIKey=ATUVDIADSMQSEJ-UHFFFAOYSA-N
Data  1 KI
  Tab Delimited (TSV)   2D SDfile   Computed 3D by Vconf -m prep SDfile
Find this compound or compounds like it in BindingDB:
Activity Spreadsheet -- Enzyme Inhibition Constant Data from BindingDB
Found 1 hit for monomerid = 50342725
TargetNeuropeptide Y receptor type 1(Homo sapiens (Human))
Pfizer
Curated by ChEMBL
LigandPNGBDBM50342725(CHEMBL1771263 | N1-(3-(2,6-dichloro-4-methoxypheny...)
Affinity DataKi:  141nM. Assay description: Displacement of [125I]-PYY from human recombinant NPY Y1 receptor overexpressed in membrane of Sf9 cells
In DepthDetails ArticlePubMed