BDBM50343881 4-(4-(1,1,1,3,3,3-hexafluoro-2-hydroxypropan-2-yl)thiophen-3-yl)-7-(4-(trifluoromethoxy)phenyl)-2-naphthoic acid::CHEMBL1774896
SMILES OC(=O)c1cc(-c2cscc2C(O)(C(F)(F)F)C(F)(F)F)c2ccc(cc2c1)-c1ccc(OC(F)(F)F)cc1
InChI Key InChIKey=QFWPUZBCALDZQR-UHFFFAOYSA-N
Data  1 IC50
  Tab Delimited (TSV)   2D SDfile   Computed 3D by Vconf -m prep SDfile
Find this compound or compounds like it in BindingDB:
Activity Spreadsheet -- Enzyme Inhibition Constant Data from BindingDB
Found 1 hit for monomerid = 50343881
TargetP2Y purinoceptor 14(Mus musculus)
Merck Frosst Centre For Therapeutic Research
Curated by ChEMBL
LigandPNGBDBM50343881(4-(4-(1,1,1,3,3,3-hexafluoro-2-hydroxypropan-2-yl)...)
Affinity DataIC50:  350nM. Assay description: Antagonist activity at mouse P2Y14 receptor expressed in HEK293 cells assessed as calcium flux by FLIPR assay
In DepthDetails ArticlePubMed