BDBM50344491 (1S,5S)-1-cyclopropylethyl 3-(5-methyl-6-(2-methylpyridin-3-yloxy)pyrimidin-4-yloxy)-8-azabicyclo[3.2.1]octane-8-carboxylate::CHEMBL1778145
SMILES CC(OC(=O)N1[C@H]2CC[C@H]1CC(C2)Oc1ncnc(Oc2cccnc2C)c1C)C1CC1
InChI Key InChIKey=FDSDOZCPFJXOEY-MSYFUGIWSA-N
Data  2 EC50
  Tab Delimited (TSV)   2D SDfile   Computed 3D by Vconf -m prep SDfile
Find this compound or compounds like it in BindingDB:
Activity Spreadsheet -- Enzyme Inhibition Constant Data from BindingDB
Found 2 hits for monomerid = 50344491
TargetGlucose-dependent insulinotropic receptor(Mus musculus)
Merck Research Laboratories
Curated by ChEMBL
LigandPNGBDBM50344491((1S,5S)-1-cyclopropylethyl 3-(5-methyl-6-(2-methyl...)
Affinity DataEC50:  59nM. Assay description: Agonist activity at mouse GPR119 expressed in HEK293 cells assessed as stimulation of cMAP level by cell-based cAMP assay
In DepthDetails ArticlePubMed
TargetGlucose-dependent insulinotropic receptor(Homo sapiens (Human))
Merck Research Laboratories
Curated by ChEMBL
LigandPNGBDBM50344491((1S,5S)-1-cyclopropylethyl 3-(5-methyl-6-(2-methyl...)
Affinity DataEC50:  38nM. Assay description: Agonist activity at human GPR119 expressed in HEK293 cells assessed as stimulation of cMAP level by cell-based cAMP assay
In DepthDetails ArticlePubMed