BDBM50345340 (+)-Pisatin::CHEMBL1784262
SMILES COc1ccc2[C@H]3Oc4cc5OCOc5cc4[C@@]3(O)COc2c1
InChI Key InChIKey=LZMRDTLRSDRUSU-SJORKVTESA-N
Data  1 IC50
  Tab Delimited (TSV)   2D SDfile   Computed 3D by Vconf -m prep SDfile
Find this compound or compounds like it in BindingDB:
Activity Spreadsheet -- Enzyme Inhibition Constant Data from BindingDB
Found 1 hit for monomerid = 50345340
TargetEstrogen receptor(Homo sapiens (Human))
National Research Centre
Curated by ChEMBL
LigandPNGBDBM50345340((+)-Pisatin | CHEMBL1784262)
Affinity DataIC50: >5.00E+6nM. Assay description: Inhibition of fluorescence-labeled 17beta-estradiol binding to ERalpha receptor after 2 hrs by fluorometric analysis
In DepthDetails ArticlePubMed