BDBM50345935 9-Allylamino-3-(4-fluoro-3-methoxy-phenyl)-3H-pyrido[3',2':4,5]thieno[3,2-d]pyrimidin-4-one::CHEMBL1783862
SMILES COc1cc(ccc1F)-n1cnc2c3c(NCC=C)ccnc3sc2c1=O
InChI Key InChIKey=APAUJASDVVDRFR-UHFFFAOYSA-N
Data  1 KI  2 IC50
  Tab Delimited (TSV)   2D SDfile   Computed 3D by Vconf -m prep SDfile
Find this compound or compounds like it in BindingDB:
Activity Spreadsheet -- Enzyme Inhibition Constant Data from BindingDB
Found 3 hits for monomerid = 50345935
TargetMetabotropic glutamate receptor 1(RAT)
Schering-Plough Research Institute
Curated by ChEMBL
LigandPNGBDBM50345935(9-Allylamino-3-(4-fluoro-3-methoxy-phenyl)-3H-pyri...)
Affinity DataKi:  14nM. Assay description: Antagonist activity at rat mGluR1
In DepthDetails ArticlePubMed
TargetMetabotropic glutamate receptor 1(Homo sapiens (Human))
Schering-Plough Research Institute
Curated by ChEMBL
LigandPNGBDBM50345935(9-Allylamino-3-(4-fluoro-3-methoxy-phenyl)-3H-pyri...)
Affinity DataIC50:  6.80nM. Assay description: Antagonist activity at human mGluR1
In DepthDetails ArticlePubMed
TargetMetabotropic glutamate receptor 5(Homo sapiens (Human))
Schering-Plough Research Institute
Curated by ChEMBL
LigandPNGBDBM50345935(9-Allylamino-3-(4-fluoro-3-methoxy-phenyl)-3H-pyri...)
Affinity DataIC50: >3.00E+3nM. Assay description: Antagonist activity at human mGluR5
In DepthDetails ArticlePubMed