BDBM50346583 CHEMBL1795978
SMILES O=C(CNC1CC1c1ccccc1)NC1CC1
InChI Key InChIKey=UAKUONIDEXEZSJ-UHFFFAOYSA-N
Data  1 KI
  Tab Delimited (TSV)   2D SDfile   Computed 3D by Vconf -m prep SDfile
Find this compound or compounds like it in BindingDB:
Activity Spreadsheet -- Enzyme Inhibition Constant Data from BindingDB
Found 1 hit for monomerid = 50346583
TargetLysine-specific histone demethylase 1A(Homo sapiens (Human))
University Of Southampton
Curated by ChEMBL
LigandPNGBDBM50346583(CHEMBL1795978)
Affinity DataKi:  6.00E+3nM. Assay description: Inhibition of human LSD1
In DepthDetails ArticlePubMed