BDBM50347846 CHEMBL1802478
SMILES [#7]-[#6]-[#6](=O)-[#7]-[#6]-[#6](=O)-[#7]-[#6@@H](-[#6]-c1ccccc1)-[#6](=O)-[#7]-[#6@@H](-[#6]-[#8])-[#6](=O)-[#7]-[#6@@H](-[#6]-c1ccccc1)-[#6](=O)-[#7]-[#6@@H](-[#6]-[#6]-[#6]\[#7]=[#6](/[#7])-[#7])-[#6](=O)-[#7]-[#6@@H](-[#6]-c1ccccc1)-[#6](=O)-[#7](-[#7]-1-[#6]-[#6]-[#6]-[#6]-[#6]-1)-[#7]-1-[#6]-[#6]-[#6]-[#6]-[#6]-1
InChI Key InChIKey=WHKGVVCZCPJAER-FDXDWZSASA-N
Data  1 EC50
  Tab Delimited (TSV)   2D SDfile   Computed 3D by Vconf -m prep SDfile
Find this compound or compounds like it in BindingDB:
Activity Spreadsheet -- Enzyme Inhibition Constant Data from BindingDB
Found 1 hit for monomerid = 50347846
TargetPyroglutamylated RF-amide peptide receptor(Homo sapiens (Human))
University Of Rouen
Curated by ChEMBL
LigandPNGBDBM50347846(CHEMBL1802478)
Affinity DataEC50:  1.20E+3nM. Assay description: Agonist activity at DYKDDDDK-flagged human GPR103 receptor expressed in CHO-K1 cells co-expressing G-protein alpha16 assessed as stimulation of calci...
In DepthDetails ArticlePubMed