BDBM50349652 CHEMBL1809011
SMILES OC1CCN(CC1)C(=O)[C@H]1CN([C@@H]2Cc3c[nH]c4cccc(C2=C1)c34)C(=O)Nc1ccccc1
InChI Key InChIKey=CAOVBFVVCXSCPJ-HOYKHHGWSA-N
Data  5 IC50
  Tab Delimited (TSV)   2D SDfile   Computed 3D by Vconf -m prep SDfile
Find this compound or compounds like it in BindingDB:
Activity Spreadsheet -- Enzyme Inhibition Constant Data from BindingDB
Found 5 hits for monomerid = 50349652
TargetC-X-C chemokine receptor type 3(Homo sapiens (Human))
Novartis Institutes For Biomedical Research
Curated by ChEMBL
LigandPNGBDBM50349652(CHEMBL1809011)
Affinity DataIC50:  14nM. Assay description: Displacement of radiolabeled CXCL11 from human CXCR3 expressed in CHO cells by scintillation proximity assay
In DepthDetails ArticlePubMed
TargetC-X-C chemokine receptor type 3(Homo sapiens (Human))
Novartis Institutes For Biomedical Research
Curated by ChEMBL
LigandPNGBDBM50349652(CHEMBL1809011)
Affinity DataIC50:  5nM. Assay description: Antagonist activity at human CXCR3 expressed in mouse L1.2 cells assessed as inhibition of ITAC-induced calcium mobilization by FLIPR assay
In DepthDetails ArticlePubMed
TargetC-X-C chemokine receptor type 3(Rattus norvegicus)
Novartis Institutes For Biomedical Research
Curated by ChEMBL
LigandPNGBDBM50349652(CHEMBL1809011)
Affinity DataIC50:  410nM. Assay description: Ex vivo receptor occupancy of CXCR3 in rat blood assessed as inhibition of ITAC binding after 1 hr by flow cytometry
In DepthDetails ArticlePubMed
TargetC-X-C chemokine receptor type 3(Homo sapiens (Human))
Novartis Institutes For Biomedical Research
Curated by ChEMBL
LigandPNGBDBM50349652(CHEMBL1809011)
Affinity DataIC50:  200nM. Assay description: Ex vivo receptor occupancy of CXCR3 in human blood assessed as inhibition of ITAC binding after 1 hr by flow cytometry
In DepthDetails ArticlePubMed
TargetC-X-C chemokine receptor type 3(Mus musculus)
Novartis Institutes For Biomedical Research
Curated by ChEMBL
LigandPNGBDBM50349652(CHEMBL1809011)
Affinity DataIC50:  8nM. Assay description: Antagonist activity at mouse CXCR3 expressed in mouse L1.2 cells assessed as inhibition of ITAC-induced calcium mobilization by FLIPR assay
In DepthDetails ArticlePubMed