BDBM50355382 CHEMBL1835943
SMILES CC(=O)NC(CCCCNC(=O)CCC#C)C(=O)N[C@@H](Cc1cnc[nH]1)C(=O)N[C@H](Cc1ccccc1)C(=O)N[C@@H](CCCN=C(N)N)C(=O)N[C@@H](Cc1c[nH]c2ccccc12)C(=O)Nc1cn(CCC(=O)NCCCC(CCCNC(=O)CCn2cc(NC(=O)[C@H](Cc3c[nH]c4ccccc34)NC(=O)[C@H](CCCN=C(N)N)NC(=O)[C@@H](Cc3ccccc3)NC(=O)[C@H](Cc3cnc[nH]3)NC(=O)C(CCCCNC(=O)CCC#C)NC(C)=O)nn2)(NC(=O)CNC(=O)CCn2cc(NC(=O)[C@H](Cc3c[nH]c4ccccc34)NC(=O)[C@H](CCCN=C(N)N)NC(=O)[C@@H](Cc3ccccc3)NC(=O)[C@H](Cc3cnc[nH]3)NC(=O)C(CCCCNC(=O)CCC#C)NC(C)=O)nn2)C(=O)NCCC(N)=O)nn1
InChI Key InChIKey=AQNRZHHFDNXHOZ-ATGMIZADSA-N
Data  1 IC50
  Tab Delimited (TSV)   2D SDfile   Computed 3D by Vconf -m prep SDfile
Find this compound or compounds like it in BindingDB:
Activity Spreadsheet -- Enzyme Inhibition Constant Data from BindingDB
Found 1 hit for monomerid = 50355382
TargetMelanocortin receptor 4(Homo sapiens (Human))
Universit£
Curated by ChEMBL
LigandPNGBDBM50355382(CHEMBL1835943)
Affinity DataIC50:  88nM. Assay description: Displacement of Eu-NDP-alpha-MSH from human MC4R expressed in HEK293 cells after 2 hrs by time resolved fluorescence assay
In DepthDetails ArticlePubMed