BDBM50361237 CHEMBL1934527
SMILES C[C@@H]1CCCN1CCc1ccc(cc1)-c1ccc(cc1)S(=O)(=O)CC1CCCCO1
InChI Key InChIKey=AHDCQPKUMADGLJ-CGHJUBPDSA-N
Data  1 KI
  Tab Delimited (TSV)   2D SDfile   Computed 3D by Vconf -m prep SDfile
Find this compound or compounds like it in BindingDB:
Activity Spreadsheet -- Enzyme Inhibition Constant Data from BindingDB
Found 1 hit for monomerid = 50361237
TargetHistamine H3 receptor(Rattus norvegicus (rat))
Arena Pharmaceuticals
Curated by ChEMBL
LigandPNGBDBM50361237(CHEMBL1934527)
Affinity DataKi:  0.200nM. Assay description: Displacement of N-[3H]-methylhistamine from histamine H3 receptor in rat cortex membranes
In DepthDetails ArticlePubMed