BDBM50363477 CHEMBL1944921
SMILES COc1cccc2C(=O)c3c(O)ccc(O)c3C(=O)c12
InChI Key InChIKey=MHYRKUJLYMYRNX-UHFFFAOYSA-N
Data  2 IC50
  Tab Delimited (TSV)   2D SDfile   Computed 3D by Vconf -m prep SDfile
Find this compound or compounds like it in BindingDB:
Activity Spreadsheet -- Enzyme Inhibition Constant Data from BindingDB
Found 2 hits for monomerid = 50363477
TargetEpidermal growth factor receptor(Homo sapiens (Human))
Dalian University Of Technology
Curated by ChEMBL
LigandPNGBDBM50363477(CHEMBL1944921)
Affinity DataIC50:  4.30E+3nM. Assay description: Inhibition of wild-type EGFR expressed using baculovirus expression system by ELISA
In DepthDetails ArticlePubMed
TargetSerine/threonine-protein kinase pim-1(Homo sapiens (Human))
Xavier University Of Louisiana
Curated by ChEMBL
LigandPNGBDBM50363477(CHEMBL1944921)
Affinity DataIC50:  1.16E+4nM. Assay description: Inhibition of recombinant human Pim1
In DepthDetails ArticlePubMed