BDBM50366327 CHEMBL192037
SMILES CCCN(CCC)[C@H]1CCn2cccc2C1
InChI Key InChIKey=BCXCDTKLXHURCX-AWEZNQCLSA-N
Data  6 IC50
  Tab Delimited (TSV)   2D SDfile   Computed 3D by Vconf -m prep SDfile
Find this compound or compounds like it in BindingDB:
Activity Spreadsheet -- Enzyme Inhibition Constant Data from BindingDB
Found 6 hits for monomerid = 50366327
TargetD(2) dopamine receptor(Rattus norvegicus (rat))
TBA
Curated by ChEMBL
LigandPNGBDBM50366327(CHEMBL192037)
Affinity DataIC50:  30nM. Assay description: Compound was evaluated for binding affinity to Dopamine receptor D2 labeled with [3H]-SND 919 (0.5 nM) in rat striatal membranes
In DepthDetails Article
TargetD(1A) dopamine receptor(RAT)
TBA
Curated by ChEMBL
LigandPNGBDBM50366327(CHEMBL192037)
Affinity DataIC50:  1.45E+4nM. Assay description: Compound was evaluated for binding affinity to Dopamine receptor D1 labeled with [3H]-SCH- 23390 (0.3 nM) in rat striatal membranes
In DepthDetails Article
TargetD(2) dopamine receptor(Rattus norvegicus (rat))
TBA
Curated by ChEMBL
LigandPNGBDBM50366327(CHEMBL192037)
Affinity DataIC50:  7.10E+3nM. Assay description: Compound was evaluated for binding affinity to Dopamine receptor D2 labeled with [3H]spiroperidol (0.5 nM) in rat striatal membranes
In DepthDetails Article
TargetThymidylate synthase(Homo sapiens (Human))
Yale University
Curated by ChEMBL
LigandPNGBDBM50366327(CHEMBL192037)
Affinity DataIC50: >5.00E+5nM. Assay description: Inhibition of human thymidylate synthase
In DepthDetails ArticlePubMed
TargetBifunctional dihydrofolate reductase-thymidylate synthase(Toxoplasma gondii)
Yale University
Curated by ChEMBL
LigandPNGBDBM50366327(CHEMBL192037)
Affinity DataIC50: >5.00E+5nM. Assay description: Inhibition of Toxoplasma gondii TS-DHFR
In DepthDetails ArticlePubMed
TargetDihydrofolate reductase(Homo sapiens (Human))
Yale University
Curated by ChEMBL
LigandPNGBDBM50366327(CHEMBL192037)
Affinity DataIC50:  3.25E+5nM. Assay description: Inhibition of human DHFR
In DepthDetails ArticlePubMed