BDBM50367441 CHEMBL8268
SMILES Oc1cccc(c1)[C@H]1CCCNC1
InChI Key InChIKey=HYUOAVGLJXTEGX-JTQLQIEISA-N
Data  4 IC50
  Tab Delimited (TSV)   2D SDfile   Computed 3D by Vconf -m prep SDfile
Find this compound or compounds like it in BindingDB:
Activity Spreadsheet -- Enzyme Inhibition Constant Data from BindingDB
Found 4 hits for monomerid = 50367441
TargetSigma non-opioid intracellular receptor 1(RAT)
University Of Oxford
Curated by ChEMBL
LigandPNGBDBM50367441(CHEMBL8268)
Affinity DataIC50:  660nM. Assay description: Displacement of (+)-3PPP from sigma receptor of rat brain membraneChecked by Author
In DepthDetails ArticlePubMed
TargetSigma non-opioid intracellular receptor 1(RAT)
University Of Oxford
Curated by ChEMBL
LigandPNGBDBM50367441(CHEMBL8268)
Affinity DataIC50:  4.57E+3nM. Assay description: In vitro for binding affinity against sigma receptor using [3H](+)-3-PPP as radioligand
In DepthDetails ArticlePubMed
TargetD(2) dopamine receptor(Rattus norvegicus (rat))
University Of G£Teborg
Curated by ChEMBL
LigandPNGBDBM50367441(CHEMBL8268)
Affinity DataIC50:  435nM. Assay description: Binding affinity against Dopamine receptor D2 using [3H]spiperone as radioligand
In DepthDetails ArticlePubMed
TargetD(2) dopamine receptor(Rattus norvegicus (rat))
University Of G£Teborg
Curated by ChEMBL
LigandPNGBDBM50367441(CHEMBL8268)
Affinity DataIC50:  360nM. Assay description: Displacement of spiperone from dopamine receptor D2 of rat brain membraneChecked by Author
In DepthDetails ArticlePubMed