BDBM50367841 CHEMBL1788193
SMILES CCCCCCCCCCCCCCCCCCNC(=O)OC[C@H](COC(=O)N(Cc1cccc[n+]1CC)C(C)=O)OC
InChI Key InChIKey=LSUANMYXNFBGDT-JGCGQSQUSA-O
Data  1 IC50
  Tab Delimited (TSV)   2D SDfile   Computed 3D by Vconf -m prep SDfile
Find this compound or compounds like it in BindingDB:
Activity Spreadsheet -- Enzyme Inhibition Constant Data from BindingDB
Found 1 hit for monomerid = 50367841
TargetPlatelet-activating factor receptor(Cavia porcellus)
Takeda Chemical Industries
Curated by ChEMBL
LigandPNGBDBM50367841(CHEMBL1788193)
Affinity DataIC50:  84nM. Assay description: Inhibition of rabbit platelet aggregation induced by platelet activating factor (PAF)
In DepthDetails ArticlePubMed