BDBM50368907 CHEMBL611863
SMILES CCCCCCn1c2ncn(C3O[C@H](CO)[C@@H](O)[C@H]3O)c2c(=O)n(CCCCCC)c1=O
InChI Key InChIKey=DVAYXRDQFWKYQL-GWRCBPMCSA-N
Data  2 KI
  Tab Delimited (TSV)   2D SDfile   Computed 3D by Vconf -m prep SDfile
Find this compound or compounds like it in BindingDB:
Activity Spreadsheet -- Enzyme Inhibition Constant Data from BindingDB
Found 2 hits for monomerid = 50368907
TargetAdenosine receptor A1(Rattus norvegicus (rat))
National Institute Of Diabetes
Curated by ChEMBL
LigandPNGBDBM50368907(CHEMBL611863)
Affinity DataKi:  9.75E+3nM. Assay description: Tested for the displacement of specific [3H]PIA in rat brain membranes of A1 receptor
In DepthDetails ArticlePubMed
TargetAdenosine receptor A3(Rattus norvegicus)
National Institute Of Diabetes
Curated by ChEMBL
LigandPNGBDBM50368907(CHEMBL611863)
Affinity DataKi:  4.30E+4nM. Assay description: Displacement of specific [125]AB-MECA binding in membranes of CHO cells stably transfected with the rat A3-cDNA
In DepthDetails ArticlePubMed