BDBM50369724 HM71224::Ly3337641::Poseltinib
SMILES CN1CCN(CC1)c1ccc(Nc2nc(Oc3cccc(NC(=O)C=C)c3)c3occc3n2)cc1
InChI Key InChIKey=LZMJNVRJMFMYQS-UHFFFAOYSA-N
Data  5 IC50
  Tab Delimited (TSV)   2D SDfile   Computed 3D by Vconf -m prep SDfile
Find this compound or compounds like it in BindingDB:
Activity Spreadsheet -- Enzyme Inhibition Constant Data from BindingDB
Found 5 hits for monomerid = 50369724
TargetTyrosine-protein kinase BTK(Homo sapiens (Human))
Shaanxi University Of Science & Technology
Curated by ChEMBL
LigandPNGBDBM50369724(HM71224 | Ly3337641 | Poseltinib)
Affinity DataIC50:  652nM. Assay description: Inhibition of BTK (unknown origin)
In DepthDetails ArticlePubMed
TargetTyrosine-protein kinase JAK3(Homo sapiens (Human))
Dalian Medical University
Curated by ChEMBL
LigandPNGBDBM50369724(HM71224 | Ly3337641 | Poseltinib)
Affinity DataIC50:  15nM. Assay description: Inhibition of recombinant human N-terminal GST-tagged JAK3 (781 to end residues) expressed in baculovirus infected Sf9 cells using poly (Glu,Tyr) 4:1...
In DepthDetails ArticlePubMed
TargetEarly activation antigen CD69(Homo sapiens)
Biogen
Curated by ChEMBL
LigandPNGBDBM50369724(HM71224 | Ly3337641 | Poseltinib)
Affinity DataIC50:  980nM. Assay description: Inhibition of CD69 in human whole blood preincubated for 30 mins followed by anti-human IgD stimulation and measured after 18 to 22 hrs by flow cytom...
In DepthDetails ArticlePubMed
TargetTyrosine-protein kinase BTK(Homo sapiens (Human))
Shaanxi University Of Science & Technology
Curated by ChEMBL
LigandPNGBDBM50369724(HM71224 | Ly3337641 | Poseltinib)
Affinity DataIC50:  1nM. Assay description: Inhibition of human BTK using fluorescein-labeled polyGAT peptide as substrate incubated for 30 mins by FRET assay
In DepthDetails ArticlePubMed
TargetTyrosine-protein kinase BTK(Homo sapiens (Human))
Shaanxi University Of Science & Technology
Curated by ChEMBL
LigandPNGBDBM50369724(HM71224 | Ly3337641 | Poseltinib)
Affinity DataIC50:  2nM. Assay description: Inhibition of BTK (unknown origin) One-hour enzymatic assay without pre-incubation
In DepthDetails ArticlePubMed