BDBM50371793 CHEMBL271703
SMILES C[C@H](CO)Nc1nc(SCc2cccc(F)c2F)nc2nc(N)cnc12
InChI Key InChIKey=BJILNBJSTFTMIK-MRVPVSSYSA-N
Data  1 IC50
  Tab Delimited (TSV)   2D SDfile   Computed 3D by Vconf -m prep SDfile
Find this compound or compounds like it in BindingDB:
Activity Spreadsheet -- Enzyme Inhibition Constant Data from BindingDB
Found 1 hit for monomerid = 50371793
TargetC-X-C chemokine receptor type 2(Homo sapiens (Human))
Astrazeneca R&D Charnwood
Curated by ChEMBL
LigandPNGBDBM50371793(CHEMBL271703)
Affinity DataIC50:  7nM. Assay description: Displacement of [125I]IL8 from human recombinant CXCR2 expressed in HEK293 cells by SPA assay
In DepthDetails ArticlePubMed