BDBM50371876 BMS-582664::CHEMBL408444
SMILES C[C@H](COc1cn2ncnc(Oc3ccc4[nH]c(C)cc4c3F)c2c1C)OC(=O)[C@@H](C)N
InChI Key InChIKey=LTEJRLHKIYCEOX-TZMCWYRMSA-N
Data  6 IC50
  Tab Delimited (TSV)   2D SDfile   Computed 3D by Vconf -m prep SDfile
Find this compound or compounds like it in BindingDB:
Activity Spreadsheet -- Enzyme Inhibition Constant Data from BindingDB
Found 6 hits for monomerid = 50371876
TargetCytochrome P450 1A2(Homo sapiens (Human))
Bristol-Myers Squibb Research And Development
Curated by ChEMBL
LigandPNGBDBM50371876(BMS-582664 | CHEMBL408444)
Affinity DataIC50: >4.00E+4nM. Assay description: Inhibition of human CYP1A2
In DepthDetails ArticlePubMed
TargetCytochrome P450 2C9(Homo sapiens (Human))
Bristol-Myers Squibb Research And Development
Curated by ChEMBL
LigandPNGBDBM50371876(BMS-582664 | CHEMBL408444)
Affinity DataIC50:  9.70E+3nM. Assay description: Inhibition of human CYP2C9
In DepthDetails ArticlePubMed
TargetCytochrome P450 2D6(Homo sapiens (Human))
Bristol-Myers Squibb Research And Development
Curated by ChEMBL
LigandPNGBDBM50371876(BMS-582664 | CHEMBL408444)
Affinity DataIC50:  2.40E+4nM. Assay description: Inhibition of human CYP2D6
In DepthDetails ArticlePubMed
TargetCytochrome P450 3A4(Homo sapiens (Human))
Bristol-Myers Squibb Research And Development
Curated by ChEMBL
LigandPNGBDBM50371876(BMS-582664 | CHEMBL408444)
Affinity DataIC50:  510nM. Assay description: Inhibition of human CYP3A4 using 7-benzyl-trifluoromethyl coumarin
In DepthDetails ArticlePubMed
TargetCytochrome P450 3A4(Homo sapiens (Human))
Bristol-Myers Squibb Research And Development
Curated by ChEMBL
LigandPNGBDBM50371876(BMS-582664 | CHEMBL408444)
Affinity DataIC50:  1.60E+3nM. Assay description: Inhibition of human CYP3A4 using 7-benzyloxyresorufin
In DepthDetails ArticlePubMed
TargetCytochrome P450 2C19(Homo sapiens (Human))
Bristol-Myers Squibb Research And Development
Curated by ChEMBL
LigandPNGBDBM50371876(BMS-582664 | CHEMBL408444)
Affinity DataIC50:  2.10E+3nM. Assay description: Inhibition of human CYP2C19
In DepthDetails ArticlePubMed