BDBM50376306 CHEMBL406649
SMILES CS(=O)(=O)c1cc(F)cc2n3CCC(CC(O)=O)c3c(Sc3ccc(cc3)C(F)(F)F)c12
InChI Key InChIKey=BEQASZAURDGDEF-UHFFFAOYSA-N
Data  1 KI
  Tab Delimited (TSV)   2D SDfile   Computed 3D by Vconf -m prep SDfile
Find this compound or compounds like it in BindingDB:
Activity Spreadsheet -- Enzyme Inhibition Constant Data from BindingDB
Found 1 hit for monomerid = 50376306
TargetThromboxane A2 receptor(Homo sapiens (Human))
Merck Frosst Canada
Curated by ChEMBL
LigandPNGBDBM50376306(CHEMBL406649)
Affinity DataKi:  286nM. Assay description: Binding affinity to human recombinant TP receptor by radioligand competition binding assay
In DepthDetails ArticlePubMed