BDBM50380837 CHEMBL2018357
SMILES OC1CCC(CC1)N[C@@H](CC(=O)N1CCC(CC1)N1Cc2ccccc2NC1=O)C(=O)N1CCC(CC1)N1CCCCC1
InChI Key InChIKey=AYLBMSKJSZBJAD-HMNPYRHBSA-N
Data  1 IC50
  Tab Delimited (TSV)   2D SDfile   Computed 3D by Vconf -m prep SDfile
Find this compound or compounds like it in BindingDB:
Activity Spreadsheet -- Enzyme Inhibition Constant Data from BindingDB
Found 1 hit for monomerid = 50380837
TargetCalcitonin gene-related peptide type 1 receptor(Homo sapiens (Human))
Bristol-Myers Squibb Research & Development
Curated by ChEMBL
LigandPNGBDBM50380837(CHEMBL2018357)
Affinity DataIC50:  4.50E+3nM. Assay description: Displacement of [125]CGRP from human CGRP receptor expressed in human SK-N-MC cell membrane after 2 hrs by scintillation counting
In DepthDetails ArticlePubMed