BDBM50382541 CHEMBL2022243
SMILES Cc1cccc(C)c1-c1cccc(COc2ccc3C(CC(O)=O)CCc3c2)c1
InChI Key InChIKey=BHRKGZMWOJNDKC-UHFFFAOYSA-N
Data  4 KI  2 EC50
  Tab Delimited (TSV)   2D SDfile   Computed 3D by Vconf -m prep SDfile
Find this compound or compounds like it in BindingDB:
Activity Spreadsheet -- Enzyme Inhibition Constant Data from BindingDB
Found 6 hits for monomerid = 50382541
TargetFree fatty acid receptor 1(Homo sapiens (Human))
Takeda Pharmaceutical
Curated by ChEMBL
LigandPNGBDBM50382541(CHEMBL2022243)
Affinity DataKi:  210nM. Assay description: Displacement of 3-[4-({2',6'-dimethyl-6-[(4-[3H])-phenylmethoxy]biphenyl-3-yl}methoxy)phenyl] propanoic acid from human GPR40 receptor expressed in C...
In DepthDetails ArticlePubMed
TargetFree fatty acid receptor 1(Homo sapiens (Human))
Takeda Pharmaceutical
Curated by ChEMBL
LigandPNGBDBM50382541(CHEMBL2022243)
Affinity DataKi:  210nM. Assay description: Displacement of 3-[4-({2',6'-dimethyl-6-[(4-[3H])phenylmethoxy]biphenyl-3-yl}methoxy)phenyl]propanoic acid from human GPR40 expressed in CHO membrane...
In DepthDetails ArticlePubMed
TargetFree fatty acid receptor 1(Rattus norvegicus)
TBA
Curated by ChEMBL
LigandPNGBDBM50382541(CHEMBL2022243)
Affinity DataKi:  520nM. Assay description: Displacement of 3-[4-({2',6'-dimethyl-6-[(4-[3H])phenylmethoxy]biphenyl-3-yl}methoxy)phenyl]propanoic acid from rat GPR40 expressed in CHO membranes ...
In DepthDetails ArticlePubMed
TargetFree fatty acid receptor 1(Rattus norvegicus)
TBA
Curated by ChEMBL
LigandPNGBDBM50382541(CHEMBL2022243)
Affinity DataKi:  520nM. Assay description: Displacement of 3-[4-({2',6'-dimethyl-6-[(4-[3H])-phenylmethoxy]biphenyl-3-yl}methoxy)phenyl] propanoic acid from rat GPR40 receptor expressed in CHO...
In DepthDetails ArticlePubMed
TargetFree fatty acid receptor 1(Homo sapiens (Human))
Takeda Pharmaceutical
Curated by ChEMBL
LigandPNGBDBM50382541(CHEMBL2022243)
Affinity DataEC50:  33nM. Assay description: Agonist activity at human GR40 receptor expressed in CHO cells assessed as increase in intracellular calcium concentration after 90 secs by FLIPR ass...
In DepthDetails ArticlePubMed
TargetFree fatty acid receptor 1(Homo sapiens (Human))
Takeda Pharmaceutical
Curated by ChEMBL
LigandPNGBDBM50382541(CHEMBL2022243)
Affinity DataEC50:  28nM. Assay description: Agonist activity at human GPR40 expressed in CHO cells assessed as calcium influx by FLIPR assay in presence of 0.1 % BSA
In DepthDetails ArticlePubMed