BDBM50392972 CHEMBL2152372
SMILES CN1C[C@H](OC(=O)CC\C=C\C[C@@H](Cc2ccc(Cl)cc2)C1=O)c1ccccc1
InChI Key InChIKey=FDSZEPJEHLNGEA-FZQIFAQWSA-N
Data  1 IC50
  Tab Delimited (TSV)   2D SDfile   Computed 3D by Vconf -m prep SDfile
Find this compound or compounds like it in BindingDB:
Activity Spreadsheet -- Enzyme Inhibition Constant Data from BindingDB
Found 1 hit for monomerid = 50392972
TargetSmoothened homolog(Mus musculus)
TBA
Curated by ChEMBL
LigandPNGBDBM50392972(CHEMBL2152372)
Affinity DataIC50:  8.00E+3nM. Assay description: Inhibition of Smo in mouse C3H10T1/2 cells assessed as inhibition of human Shh-induced cell differentiation after 48 hrs by alkaline phosphatase repo...
In DepthDetails ArticlePubMed