BDBM50393382 CHEMBL2159476
SMILES Clc1ccc(s1)S(=O)(=O)NC1CCN(CCOc2ccccc2)C1
InChI Key InChIKey=ALMBNZHSWURVRM-UHFFFAOYSA-N
Data  4 KI
  Tab Delimited (TSV)   2D SDfile   Computed 3D by Vconf -m prep SDfile
Find this compound or compounds like it in BindingDB:
Activity Spreadsheet -- Enzyme Inhibition Constant Data from BindingDB
Found 4 hits for monomerid = 50393382
Target5-hydroxytryptamine receptor 1A(Homo sapiens (Human))
TBA
Curated by ChEMBL
LigandPNGBDBM50393382(CHEMBL2159476)
Affinity DataKi:  65nM. Assay description: Displacement of [3H]-8-OH-DPAT from human 5-HT1A receptor expressed in HEK293 cells after 1 hr
In DepthDetails ArticlePubMed
Target5-hydroxytryptamine receptor 7(Homo sapiens (Human))
TBA
Curated by ChEMBL
LigandPNGBDBM50393382(CHEMBL2159476)
Affinity DataKi:  121nM. Assay description: Displacement of [3H]-5-CT from human 5-HT7b receptor expressed in HEK293 cells after 1 hr
In DepthDetails ArticlePubMed
TargetD(2) dopamine receptor(Homo sapiens (Human))
TBA
Curated by ChEMBL
LigandPNGBDBM50393382(CHEMBL2159476)
Affinity DataKi:  318nM. Assay description: Binding affinity to human dopamine D2L receptor expressed in HEK293 cells after 1 hr
In DepthDetails ArticlePubMed
Target5-hydroxytryptamine receptor 6(Homo sapiens (Human))
TBA
Curated by ChEMBL
LigandPNGBDBM50393382(CHEMBL2159476)
Affinity DataKi:  957nM. Assay description: Displacement of [3H]-LSD from human 5-HT6 receptor expressed in HEK293 cells after 1 hr
In DepthDetails ArticlePubMed