BDBM50393387 CHEMBL2159481
SMILES Fc1ccc(cc1F)S(=O)(=O)NC1CCN(CCOc2ccccc2-c2ccccc2)C1
InChI Key InChIKey=AJRQMVCEFKRUBB-UHFFFAOYSA-N
Data  4 KI
  Tab Delimited (TSV)   2D SDfile   Computed 3D by Vconf -m prep SDfile
Find this compound or compounds like it in BindingDB:
Activity Spreadsheet -- Enzyme Inhibition Constant Data from BindingDB
Found 4 hits for monomerid = 50393387
Target5-hydroxytryptamine receptor 7(Homo sapiens (Human))
TBA
Curated by ChEMBL
LigandPNGBDBM50393387(CHEMBL2159481)
Affinity DataKi:  7nM. Assay description: Displacement of [3H]-5-CT from human 5-HT7b receptor expressed in HEK293 cells after 1 hr
In DepthDetails ArticlePubMed
TargetD(2) dopamine receptor(Homo sapiens (Human))
TBA
Curated by ChEMBL
LigandPNGBDBM50393387(CHEMBL2159481)
Affinity DataKi:  24nM. Assay description: Binding affinity to human dopamine D2L receptor expressed in HEK293 cells after 1 hr
In DepthDetails ArticlePubMed
Target5-hydroxytryptamine receptor 1A(Homo sapiens (Human))
TBA
Curated by ChEMBL
LigandPNGBDBM50393387(CHEMBL2159481)
Affinity DataKi:  92nM. Assay description: Displacement of [3H]-8-OH-DPAT from human 5-HT1A receptor expressed in HEK293 cells after 1 hr
In DepthDetails ArticlePubMed
Target5-hydroxytryptamine receptor 6(Homo sapiens (Human))
TBA
Curated by ChEMBL
LigandPNGBDBM50393387(CHEMBL2159481)
Affinity DataKi:  327nM. Assay description: Displacement of [3H]-LSD from human 5-HT6 receptor expressed in HEK293 cells after 1 hr
In DepthDetails ArticlePubMed