BDBM50393923 CHEMBL1557707
SMILES [O-][N+](=O)c1cccc(c1)C(=O)Oc1coc(CSc2ncccn2)cc1=O
InChI Key InChIKey=CCOYLGNMVJOAKJ-UHFFFAOYSA-N
Data  2 IC50
  Tab Delimited (TSV)   2D SDfile   Computed 3D by Vconf -m prep SDfile
Find this compound or compounds like it in BindingDB:
Activity Spreadsheet -- Enzyme Inhibition Constant Data from BindingDB
Found 2 hits for monomerid = 50393923
TargetType-1 angiotensin II receptor(Homo sapiens (Human))
Sanford-Burnham Medical Research Institute
Curated by ChEMBL
LigandPNGBDBM50393923(CHEMBL1557707)
Affinity DataIC50: >7.90E+4nM. Assay description: Inhibition of AT1 receptor
In DepthDetails ArticlePubMed
TargetApelin receptor(Homo sapiens (Human))
Sanford-Burnham Medical Research Institute
Curated by ChEMBL
LigandPNGBDBM50393923(CHEMBL1557707)
Affinity DataIC50:  7.57E+4nM. Assay description: Antagonist activity at APJ receptor expressed in CHOK1 cells assessed as inhibition of apelin13-induced beta-arrestin recruitment after 90 mins by lu...
In DepthDetails ArticlePubMed